{"text_format":"1","workbook":"xlsx","n_sheets":15,"sheets":["User Guide","Model Tool Instructions >>","FeasibilityEvaluator","Model Outputs >>","Matrix","Assumptions >>","HardCosts","SoftCosts","LandCosts","Revenues","Financials","OtherAssumptions","Other Documentation >>","Glossary","VBAcode"],"not_rendered":{"charts":0,"images":0,"macros":1,"external_links":0,"defined_names":107,"comments":1,"pivot_tables":0},"unopened":[],"bounds":{"document_bytes":16777216,"sheet_cells":100000,"rows_first":2000,"rows_last":500,"rows_between":2000,"halvings":0,"cell_chars":16384,"cell_head_chars":4096},"cells_cut":0,"cells_raw":0,"read":"whole","date_system":"1900"}

{"sheet":"User Guide","index":0,"n_rows":29,"n_cols":13,"rows_kept":29,"cut":false,"hidden":false,"merged":[]}
["Disclaimer: This is a DRAFT and PRELIMINARY WORK PRODUCT, prepared by 3TP Ventures and meant for the internal testing and review by the City of Charlottesville staff"]
["Note: All Figures and values in this document are preliminary and subject to validation and confirmation; any financial figures in this document are estimates, not definitive, and not to be considered as valuations"]
[]
[null,"CHARLOTTESVILLE AFFORDABLE HOUSING TAX ABATEMENT STUDY"]
[null,"Housing Development Feasibility Model"]
[null,"version current as of 12/05/2025"]
[null,"previous update: 11/21/25"]
[]
[null,"This workbook should be used to:"]
[null,"- be a resource for housing development feasibility within the City of Charlottesville"]
[null,"- explore financial implications of different public policies, regulations, or incentives as they relate to development feasbility"]
[null,"- be a repository for local development cost and revenue conditions, including hard and soft development costs, land costs, and rental revenues"]
[]
[null,"This workbook should not be used to:"]
[null,"- replace more detailed pro-forma analyses for specific projects by the City or outside development parties"]
[]
[]
[null,"This workbook consists of…"]
[null,"- the Charlottesville Development Feasibility Evaluator Tool, the primary user interface for evaluating fiscal impacts of development and policy interventions"]
[null,"- a feasibility output page that allows users to summarize financial findings from the Feasibility Evaluator tool across all housing types and submarkets"]
{"$rows_left_out":10}
{"sheet":"Model Tool Instructions >>","index":1,"n_rows":28,"n_cols":8,"rows_kept":28,"cut":false,"hidden":false,"merged":[]}
[]
[]
[null,"Model Tool Instructions >>"]
[]
[null,null,"The following tab consists of:"]
[null,null,"»","Charlottesville Development Feasiblity Assessment Project Evaluator"]
[null,null,null,null,"This tool allows users to examine the development feasibility of six different building types (from single family to hise-rise) across different land and rent tiers (Tiers 1 -5), and analyze the fiscal implications of different public interventions and incentives"]
[null,null,null,null,"This is the primary evaluative tool in this workbook, and is the primary user interface"]
[]
[null,null,"»","General Use Instructions:"]
[null,null,null,null,"Users enter or select key information about their project in the Project Inputs section, and the Yield to Cost and IRR results are presented (see 'Glossary' tab for defitions of terms) in the first column of the Overall Findings section. "]
[null,null,null,null,"Additional findings, such as estimated annual tax revenue or monthly rent \"lost\" due to inclusionary zoning are also provided"]
[null,null,null,null,"By entering or selecting a policy intervention in the Policy Testing section, a separate Yield to Cost and IRR calculation is provided in the second column under Overall Findings"]
[]
[null,null,null,null,"Cells this color",null,"allow users to enter or select project details"]
[null,null,null,null,"These cells are either drop-down menus or direct entry cells."]
[null,null,null,null," Drop-down menus are highlighted by a thicker outline and the word <- SELECT "]
[null,null,null,null,"Direct entry cells have no thick outline and are highlighted by the word <- ENTER"]
[null,null,null,null,"These cells are mostly found in the 'Project Inputs' and 'Policy Testing' sections of the worksheet, but are scattered throughout"]
[]
{"$rows_left_out":9}
{"sheet":"FeasibilityEvaluator","index":2,"n_rows":861,"n_cols":14,"rows_kept":861,"cut":false,"hidden":false,"merged":[[7,13,8,13],[6,5,6,6],[11,13,12,13]]}
[]
[]
[null,null,"CHARLOTTESVILLE DEVELOPMENT FEASIBILITY ASSESSMENT  |  Feasibility Evaluator",null,null,null,null,null,null,"OVERALL FINDINGS"]
[]
[null,null,"PROJECT INPUTS",null,null,null,null,null,null,"WITHOUT INCENTIVES",null,"WITH INCENTIVES",null,"DIFFERENCE"]
[]
[null,null,"Development Type","Mid Rise","<- SELECT","Affordable Units",null,null,null,"Yield on Cost",null,"Yield on Cost",null,"Yield"]
[null,null,"Submarket","Tier 2","<- SELECT","AMI Band 1",0.6,"<- SELECT",null,{"$f":"Weighted_NOI*Total_Units*12/Total_Project_Costs","v":4.7986633771378719E-2},null,{"$f":"Weighted_Incentive_NOI*Total_Units*12/Incentive_Total_Project_Costs","v":4.7986633771378719E-2},null,{"$f":"Incentive_Yield_on_Cost-Yield_on_Cost","v":0}]
[null,null,"Buildings in Project",{"$f":"_xlfn.XLOOKUP(Building_Type,OtherAssumptions!B54:B59,_xlfn.XLOOKUP(Price_Land_Context,OtherAssumptions!C53:G53,OtherAssumptions!C54:G59))","v":3},null,"% of Units",0.1,"<- ENTER",null,{"$f":"IF(J8=\"TBD\",\"\",IF(J8>=Financials!C$19,\"Likely Feasible\",IF(AND(J8<Financials!C$19,J8>=Financials!C$20),\"Possibly Feasible\",\"Unlikely Feasibility\")))","v":"Unlikely Feasibility"},null,{"$f":"IF(L8=\"TBD\",\"\",IF(L8>=Financials!C19,\"Likely Feasible\",IF(AND(L8<Financials!C19,L8>=Financials!C20),\"Possibly Feasible\",\"Unlikely Feasibility\")))","v":"Unlikely Feasibility"}]
[null,null,"Avg Units per Building",{"$f":"_xlfn.XLOOKUP(Building_Type,HardCosts!B5:B10,HardCosts!C5:C10)","v":45},null,"AMI Band 2",0.8,"<- SELECT"]
[null,null,"Total Units",{"$f":"Buildings*Avg_Units_per_Building","v":135},null,"% of Units",0,"<- ENTER",null,"IRR",null,"IRR",null,"IRR"]
[null,null,"Parking Type",{"$f":"_xlfn.XLOOKUP(Building_Type,HardCosts!B22:B27,_xlfn.XLOOKUP(Price_Land_Context,HardCosts!C21:G21,HardCosts!C22:G27))","v":"Above Ground Deck"},null,"AMI Band 3",1,"<- SELECT",null,{"$f":"XIRR(I136:I496,L136:L496,0.05)","v":3.2691064476966861E-2},null,{"$f":"XIRR(I501:I861,L501:L861,0.05)","v":3.2691064476966861E-2},null,{"$f":"Incentive_IRR-IRR","v":0}]
[null,null,"Spaces per Unit",{"$f":"_xlfn.XLOOKUP(Building_Type,HardCosts!B30:B35,_xlfn.XLOOKUP(Price_Land_Context,HardCosts!C29:G29,HardCosts!C30:G35))","v":0.75},null,"% of Units",0,"<- ENTER",null,{"$f":"IF(J12>=Financials!C25,\"Likely Feasible\",IF(AND(J12<Financials!C25,J12>=Financials!C26),\"Possibly Feasible\",\"Unlikely Feasibility\"))","v":"Unlikely Feasibility"},null,{"$f":"IF(L12>=Financials!C25,\"Likely Feasible\",IF(AND(L12<Financials!C25,L12>=Financials!C26),\"Possibly Feasible\",\"Unlikely Feasibility\"))","v":"Unlikely Feasibility"}]
[null,null,null,null,null,"Total Affordable Units",{"$f":"SUM(AMI_Band_1_Pct,AMI_Band_2_Pct,AMI_Band_3_Pct)*Total_Units","v":13.5}]
[null,null,null,"Cost Adjustments"]
[null,null,"Construction","Standard","<- SELECT"]
[null,null,"Land","Standard","<- SELECT",null,null,null,null,"OTHER SUMMARIES OF INCENTIVE COSTS & BENEFITS"]
[null,null,"Rent","Standard","<- SELECT"]
[null,null,null,null,null,null,null,null,null,"Inclusionary Zoning Rent Change",null,"Abatement Provides",null,"Difference"]
[null,null,"POLICY TESTING",null,null,null,null,null,null,{"$f":"(Incentive_Weighted_Avg_Rent-Weighted_Avg_Rent)*Units_Affordable","v":-15460.368750000001},null,{"$f":"(Weighted_Incentive_NOI-Weighted_NOI)*Total_Units","v":0},null,{"$f":"L20+J20","v":-15460.368750000001}]
{"$rows_left_out":842}
{"sheet":"Model Outputs >>","index":3,"n_rows":9,"n_cols":5,"rows_kept":9,"cut":false,"hidden":false,"merged":[]}
[]
[]
[null,"Model Outputs >>"]
[]
[null,null,"The following worksheet includes:"]
[null,null,"»","Run buttons to evaluate inputs from the Feasibility Evaluator Tool"]
[null,null,null,"»","Run \"Typicals\" Evaluation' button will analyze the findings of all project types and price tiers, and place findings in the Typical Project Financials matrix to the button's immediate right"]
[null,null,null,"»","Run Incentives Evaluation' button will analyze the findings of all project types and price tiers along with the user's activated incentive, and place findings in the Typical Project Financials (with Incentive) matrix located to the button's immediate right"]
[null,null,null,"»","The Incentive Impact matrix calculates the Yield and IRR implications of the applied incentive"]

{"sheet":"Matrix","index":4,"n_rows":29,"n_cols":24,"rows_kept":29,"cut":false,"hidden":false,"merged":[[1,18,1,23],[3,18,3,23],[12,18,12,23],[1,2,1,7],[3,2,3,7],[12,2,12,7],[1,10,1,15],[3,10,3,15],[12,10,12,15]]}
[]
[null,null,"\"TYPICAL\" WITHOUT INCENTIVE PROJECT FINANCIALS",null,null,null,null,null,null,null,"\"TYPICAL\" PROJECT FINANCIALS (WITH INCENTIVE)",null,null,null,null,null,null,null,"INCENTIVE IMPACT"]
[]
[null,null,"Yield on Cost",null,null,null,null,null,null,null,"Yield on Cost",null,null,null,null,null,null,null,"Yield on Cost"]
[null,null,"Typology","Tier 1","Tier 2","Tier 3","Tier 4","Tier 5",null,null,"Typology","Tier 1","Tier 2","Tier 3","Tier 4","Tier 5",null,null,"Typology","Tier 1","Tier 2","Tier 3","Tier 4","Tier 5"]
[null,null,"High Rise",6.1192568564626376E-2,5.9399005935955797E-2,5.7849189391544917E-2,5.5174893963949263E-2,5.5487797426976071E-2,null,null,"High Rise",6.6537205332585295E-2,6.4329755784841403E-2,6.2376705420507453E-2,5.9204800181620436E-2,5.9540557727738128E-2,null,null,"High Rise",{"$f":"L6-D6","v":5.3446367679589185E-3},{"$f":"M6-E6","v":4.9307498488856058E-3},4.527516028962536E-3,4.0299062176711725E-3,4.0527603007620566E-3]
[null,null,"Mid Rise",4.9516244464180161E-2,4.7986633771378719E-2,4.4973524798088506E-2,4.2801011925840293E-2,4.7627931470116361E-2,null,null,"Mid Rise",5.3464854616073594E-2,5.1589946739335008E-2,4.8121343467064245E-2,4.5556777052444757E-2,5.0694480289687927E-2,null,null,"Mid Rise",{"$f":"L7-D7","v":3.9486101518934336E-3},{"$f":"M7-E7","v":3.6033129679562889E-3},{"$f":"N7-F7","v":3.1478186689757395E-3},{"$f":"O7-G7","v":2.7557651266044633E-3},{"$f":"P7-H7","v":3.0665488195715657E-3}]
[null,null,"Low Rise",4.4114283748687436E-2,4.0932678512194336E-2,4.2372638921341459E-2,4.1125788365545306E-2,4.1397510621272809E-2,null,null,"Low Rise",4.7027691750773551E-2,4.3210304396502919E-2,4.4479191001606064E-2,4.2902649404808903E-2,4.3186111561676087E-2,null,null,"Low Rise",2.9134080020861153E-3,2.2776258843085831E-3,2.1065520802646051E-3,1.776861039263597E-3,1.7886009404032774E-3]
[null,null,"Garden Apt",4.1987340937584917E-2,3.8968228724341525E-2,4.0612218586587569E-2,3.9575040481381822E-2,4.0444739757895101E-2,null,null,"Garden Apt",4.4625475500796104E-2,4.0986512399872471E-2,4.2460336842811357E-2,4.1102989585954576E-2,4.2006267001987924E-2,null,null,"Garden Apt",2.6381345632111863E-3,2.0182836755309463E-3,1.848118256223788E-3,1.5279491045727539E-3,1.5615272440928224E-3]
[null,null,"Townhouse",4.4333808121199601E-2,4.1123334858208564E-2,4.1968451381752495E-2,4.0206858774482976E-2,3.8571900071288918E-2,null,null,"Townhouse",4.7883513851268898E-2,4.403218642457811E-2,4.49370821107739E-2,4.2836585413795092E-2,4.0868652936777328E-2,null,null,"Townhouse",3.5497057300692969E-3,2.9088515663695455E-3,2.9686307290214056E-3,2.629726639312116E-3,2.2967528654884092E-3]
[null,null,"Single Family",5.143889234221756E-2,4.6838845149266048E-2,4.7875108241160903E-2,4.5875283744167945E-2,4.4098742847601645E-2,null,null,"Single Family",5.5767186218261607E-2,5.0431263100893499E-2,5.1547004884503929E-2,4.9198148645213047E-2,4.7085697288970989E-2,null,null,"Single Family",4.3282938760440468E-3,3.592417951627451E-3,3.6718966433430256E-3,3.3228649010451014E-3,2.9869544413693438E-3]
[]
[null,null,"IRR",null,null,null,null,null,null,null,"IRR",null,null,null,null,null,null,null,"IRR"]
[null,null,"Typology","Tier 1","Tier 2","Tier 3","Tier 4","Tier 5",null,null,"Typology","Tier 1","Tier 2","Tier 3","Tier 4","Tier 5",null,null,"Typology","Tier 1","Tier 2","Tier 3","Tier 4","Tier 5"]
[null,null,"High Rise",8.0323603749275219E-2,7.6822277903556821E-2,7.3061820864677454E-2,6.2403926253318781E-2,6.4875921607017523E-2,null,null,"High Rise",9.7883313894271851E-2,9.4107547402381919E-2,8.9875206351280212E-2,7.8715154528617867E-2,8.1221315264701846E-2,null,null,"High Rise",{"$f":"L15-D15","v":1.7559710144996632E-2},{"$f":"M15-E15","v":1.7285269498825098E-2},{"$f":"N15-F15","v":1.6813385486602758E-2},{"$f":"O15-G15","v":1.6311228275299086E-2},{"$f":"P15-H15","v":1.6345393657684323E-2}]
[null,null,"Mid Rise",3.9238867163658139E-2,3.2691064476966861E-2,1.4572611451148985E-2,-2.1853111684322357E-3,3.3093127608299258E-2,null,null,"Mid Rise",5.9384801983833321E-2,5.2721843123435974E-2,3.5400649905204779E-2,1.900364458560944E-2,5.0889644026756276E-2,null,null,"Mid Rise",{"$f":"L16-D16","v":2.0145934820175182E-2},2.0030778646469113E-2,2.0828038454055793E-2,2.1188955754041675E-2,1.7796516418457017E-2]
[null,null,"Low Rise",5.4695338010787966E-3,2.9802322387695314E-9,-6.5915122628211979E-3,2.9802322387695314E-9,2.9802322387695314E-9,null,null,"Low Rise",2.5580045580863953E-2,-7.4807927012443537E-5,1.0408225655555728E-2,-3.3704647794365885E-4,3.0746012926101693E-3,null,null,"Low Rise",2.0110511779785158E-2,-7.4810907244682304E-5,1.6999737918376924E-2,-3.3704945817589763E-4,3.0745983123779304E-3]
[null,null,"Garden Apt",-1.5611489117145537E-2,2.9802322387695314E-9,-2.4391613155603412E-2,2.9802322387695314E-9,2.9802322387695314E-9,null,null,"Garden Apt",5.2487283945083629E-3,-2.1360975876450541E-2,-7.1040295064449316E-3,-1.808154657483101E-2,-6.4957018941640861E-3,null,null,"Garden Apt",2.08602175116539E-2,-2.1360978856682779E-2,1.7287583649158479E-2,-1.8081549555063248E-2,-6.495704874396325E-3]
[null,null,"Townhouse",3.7378698587417604E-3,-1.8455632030963905E-2,-7.7493485063314434E-3,-2.3256116732954982E-2,2.9802322387695314E-9,null,null,"Townhouse",2.7158537507057188E-2,6.6341072320938122E-3,1.6560944914817809E-2,2.2101551294326791E-3,-1.5242349356412888E-2,null,null,"Townhouse",2.3420667648315428E-2,2.5089739263057718E-2,2.4310293421149251E-2,2.546627186238766E-2,-1.5242352336645126E-2]
[null,null,"Single Family",4.4830438494682323E-2,2.5330522656440733E-2,3.5507610440254231E-2,2.4933406710624693E-2,1.3447931408882143E-2,null,null,"Single Family",6.4941421151161194E-2,4.6529415249824527E-2,5.6531593203544617E-2,4.6323785185813898E-2,3.5053673386573794E-2,null,null,"Single Family",2.0110982656478871E-2,2.1198892593383794E-2,2.1023982763290386E-2,2.1390378475189206E-2,2.1605741977691651E-2]
{"$rows_left_out":10}
{"sheet":"Assumptions >>","index":5,"n_rows":15,"n_cols":10,"rows_kept":15,"cut":false,"hidden":false,"merged":[]}
[]
[]
[null,"Assumptions >>"]
[]
[null,null,"The following tabs consists of:"]
[null,null,"»","Hard Cost Assumptions"]
[null,null,"»","Land Cost Assumptions"]
[null,null,"»","Soft Cost Assumptions"]
[null,null,"»","Revenue Assumptions"]
[null,null,"»","Financial Assumptions"]
[null,null,"»","Other Relevant Assumptions"]
[null,null,"»","Residential Unit Sizes"]
[]
[null,null,null,null,null,null,null,"For users wishing to update any assumptions, cells this color ",null,"directly link to the Feasibility Evaluator's inputs and calculations. All others have no direct connection"]
[null,null,"  Please avoid moving cell locations to prevent impacts to formulas or macros"]

{"sheet":"HardCosts","index":6,"n_rows":46,"n_cols":7,"rows_kept":46,"cut":false,"hidden":false,"merged":[]}
[]
[null,"PER UNIT BUILDING COSTS"]
[]
[null,"Housing Type","Units per building","Per Unit Price","Add'l Per Unit per Bldg Discount"]
[null,"Garden Apt",18,275275,-310]
[null,"Low Rise",27,297000,-310]
[null,"Mid Rise",45,300000,-300]
[null,"High Rise",100,243750,-110]
[null,"Single Family",1,412000,0]
[null,"Townhouse",1,387600,0]
[]
[null,"PER SPACE PARKING COSTS"]
[]
[null,"Parking","Per Space"]
[null,"Above Ground Deck",{"$f":"98*400","v":39200}]
[null,"Below Ground Deck",{"$f":"140*400","v":56000}]
[null,"Surface",{"$f":"12*400","v":4800}]
[]
[null,"PARKING ASSUMPTIONS"]
[null,"Parking Type"]
{"$rows_left_out":27}
{"sheet":"SoftCosts","index":7,"n_rows":11,"n_cols":4,"rows_kept":11,"cut":false,"hidden":false,"merged":[]}
[]
[null,"CONSULTANT FEES"]
[]
[null,"Type","Amount"]
[null,"Standard",0.15,"assumes standard engagement period"]
[null,"Minimum",0.12]
[]
[null,"MUNICIPAL FEES"]
[]
[null,"Amount","Notes"]
[null,4.4999999999999998E-2,"of hard costs"]

{"sheet":"LandCosts","index":8,"n_rows":10,"n_cols":7,"rows_kept":10,"cut":false,"hidden":false,"merged":[]}
[]
[null,"PER UNIT LAND COSTS"]
[]
[null,"Housing Type","Tier 1","Tier 2","Tier 3","Tier 4","Tier 5"]
[null,"Garden Apt",47500,36000,31000,26500,18500]
[null,"Low Rise",25000,20500,17500,13000,10500]
[null,"Mid Rise",21500,16000,12000,11333.333333333334,9333.3333333333339]
[null,"High Rise",21500,16000,12000,11333.333333333334,9333.3333333333339]
[null,"Single Family",81000,58166.666666666672,45000,36500,30500]
[null,"Townhouse",67833.333333333343,48555.555555555555,37611.111111111117,30055.555555555558,26333.333333333336]

{"sheet":"Revenues","index":9,"n_rows":27,"n_cols":7,"rows_kept":27,"cut":false,"hidden":false,"merged":[]}
[]
[null,"SUMMARY"]
[]
[null,"Housing Type","Studio","1 Bed","2 Bed","3 Bed"]
[null,"Garden Apt",1810,1940,2310,2790]
[null,"Low Rise",1809.5,2100.28125,2540,2850]
[null,"Mid Rise",1930,2310,3410,4700]
[null,"High Rise",2130,2540,3750,4700]
[null,"Single Family",null,null,3540,4000]
[null,"Townhouse",null,null,2800,3100]
[]
[null,"Tier Adjustments","Tier 1","Tier 2","Tier 3","Tier 4","Tier 5"]
[null,"Garden Apt",1.1000000000000001,1,0.95,0.9,0.9]
[null,"Low Rise",1.1000000000000001,1,0.95,0.9,0.9]
[null,"Mid Rise",1.05,1,0.95,0.9,0.9]
[null,"High Rise",1.05,1,0.95,0.9,0.9]
[null,"Single Family",1.1000000000000001,1,1,0.95,0.9]
[null,"Townhouse",1.1000000000000001,1,1,0.95,0.9]
[]
[]
{"$rows_left_out":8}
{"sheet":"Financials","index":10,"n_rows":26,"n_cols":4,"rows_kept":26,"cut":false,"hidden":false,"merged":[]}
[]
[null,"FINANCE & FINANCIAL ASSUMPTIONS"]
[]
[null,"Type","Amount"]
[null,"Loan-to-Value",0.65]
[null,"Construction Loan Rate",5.7500000000000002E-2]
[null,"Construction Loan Timeframe",360]
[null,"Origination Fees",8.0000000000000002E-3]
[null,"Month of Sale",180]
[null,"Pre-Dev Equity",0.75]
[null,"Predev Loan Rate",0.11]
[null,"Cap Rate",4.7500000000000001E-2]
[null,"Exit Cap Rate",{"$f":"C12+0.0005*C9/12","v":5.5E-2}]
[]
[]
[]
[null,"YIELD ON COST THRESHOLDS"]
[]
[null,"Likely Feasible",{"$f":"C12+0.02","v":6.7500000000000004E-2},"<-- defined as 200 bps above cap rate"]
[null,"Possibly Feasible",{"$f":"C12+0.01","v":5.7500000000000002E-2},"<-- defined as 100 bps above cap rate"]
{"$rows_left_out":7}
{"sheet":"OtherAssumptions","index":11,"n_rows":83,"n_cols":7,"rows_kept":83,"cut":false,"hidden":false,"merged":[]}
[]
[null,"Tax"]
[]
[null,"Rate","Note"]
[null,0.98,"per $100 assessed value"]
[]
[]
[null,"CONSTRUCTION TIMELINE"]
[]
[null,"Housing Type","Months"]
[null,"Garden Apt",12]
[null,"Low Rise",16]
[null,"Mid Rise",18]
[null,"High Rise",24]
[null,"Single Family",10]
[null,"Townhouse",10]
[]
[null,"PREDEVELOPMENT TIMELINE"]
[]
[null,"Housing Type","Tier 1","Tier 2","Tier 3","Tier 4","Tier 5"]
{"$rows_left_out":64}
{"sheet":"Other Documentation >>","index":12,"n_rows":6,"n_cols":4,"rows_kept":6,"cut":false,"hidden":false,"merged":[]}
[]
[]
[null,"Other Documentation:"]
[]
[null,null,"The following tabs consists of:"]
[null,null,"»","Glossary of Terms"]

{"sheet":"Glossary","index":13,"n_rows":31,"n_cols":4,"rows_kept":31,"cut":false,"hidden":false,"merged":[]}
[]
[null,"Glossary of Terms:"]
[]
[null,null,"Term","Definition "]
[null,null,"AMI","Annual Median Income"]
[null,null,"Annual Revenue Waived","The annual amount of theoretical tax revenue waived or otherwise reimbursed through the selected tax abatement"]
[null,null,"Cap Rate","The annual rate of return of the project at the present time, calculated by dividing the properties Net Annual Income by its current market value."]
[null,null,"Duplex","One residential dwelling separated into two units."]
[null,null,"Exit Cap Rate","The projected capitalization rate used to estimate a property's future selling price at the end of its holding period. Calculated by the property's expected future Net Operating Income at sale date by anticipated sale price at sale date."]
[null,null,"Gap Financing","Short-term loan used to cover a temporary funding shortfall between and expected financial event and the availability of longer-term funds "]
[null,null,"Garden Apt","Residential buildings typically between 2 to 4 stories that have access to greenspaces."]
[null,null,"Hard Cost","Tangible, physical expense directly related to the constructing of a building or structure, such as materials, labor, and equipment."]
[null,null,"High Rise","Multi-story residential building that typically exceeds 7 stories or 75 feet tall."]
[null,null,"IRR","Internal Rate of Return. The Net Present Value of all cashflows (positive and negative) from the project. "]
[null,null,"Loan-to-Value","An assessment of lending risk that is the ratio of the loan amount to the value of the asset, calculated by dividing the loan amount by the appraised value then multiplying by 100. "]
[null,null,"Low Rise","Residential  buildings typically with no more than 4 stories and typically have limited greenspaces."]
[null,null,"Mid Rise","Multi-story residential  building typically ranging from 5 to 10 stories or less than 75 feet tall. "]
[null,null,"Net Operating Income ","Calculation of a property's profitability that represents its total income minus all operating expenses, before accounting for financing costs and income taxes."]
[null,null,"Occupancy Rate","The percentage of units assumed to be occupied and paying rent. Occupancy rates can be set  by users for both market-rate and affordable units"]
[null,null,"Pre-Dev Equity","Percentage of investor's ownership during predevelopment"]
{"$rows_left_out":12}
{"sheet":"VBAcode","index":14,"n_rows":392,"n_cols":1,"rows_kept":392,"cut":false,"hidden":false,"merged":[]}
["Note to user: for those who cannot enable macros, you can use the VBA code below to re-create the macros. Please paste this directly into your Visual Basic window"]
[]
["Sub MatrixFiller()"]
[]
["Worksheets(\"Matrix\").Range(\"Matrix_First_Cell\").Activate"]
["'High Rise'"]
["Worksheets(\"FeasibilityEvaluator\").Range(\"Building_Type\").Value = \"High Rise\""]
["    Worksheets(\"FeasibilityEvaluator\").Range(\"Price_Land_Context\").Value = \"Tier 1\""]
["    ActiveCell.Value = Worksheets(\"FeasibilityEvaluator\").Range(\"Yield_on_Cost\").Value"]
["    ActiveCell.Offset(9, 0).Select"]
["    ActiveCell.Value = Worksheets(\"FeasibilityEvaluator\").Range(\"IRR\").Value"]
["    ActiveCell.Offset(-9, 1).Select"]
["    Worksheets(\"FeasibilityEvaluator\").Range(\"Price_Land_Context\").Value = \"Tier 2\""]
["    ActiveCell.Value = Worksheets(\"FeasibilityEvaluator\").Range(\"Yield_on_Cost\").Value"]
["    ActiveCell.Offset(9, 0).Select"]
["    ActiveCell.Value = Worksheets(\"FeasibilityEvaluator\").Range(\"IRR\").Value"]
["    ActiveCell.Offset(-9, 1).Select"]
["    Worksheets(\"FeasibilityEvaluator\").Range(\"Price_Land_Context\").Value = \"Tier 3\""]
["    ActiveCell.Value = Worksheets(\"FeasibilityEvaluator\").Range(\"Yield_on_Cost\").Value"]
["    ActiveCell.Offset(9, 0).Select"]
{"$rows_left_out":372}